Target
cAMP and cAMP-inhibited cGMP 3',5'-cyclic phosphodiesterase 10A
Ligand
BDBM194404
Substrate
Meas. Tech.
Homogenous Time-Resolved Fluorescence Resonance Energy Transfer (TR-FRET) Technology
IC50
8.30±n/a nM
Citation
 Leblond, BTaverne, TChauvignac, CBeausoleil, ECasagrande, ADesire, LPando, MPDonello, JEYang, R Substituted 6, 7-dialkoxy-3-isoquinoline derivatives as inhibitors of phosphodiesterase 10 (PDE 10A) US Patent  US9902710 Publication Date 2/27/2018 
Target
Name:
cAMP and cAMP-inhibited cGMP 3',5'-cyclic phosphodiesterase 10A
Synonyms:
3',5'-cyclic phosphodiesterase PDE10_HUMAN Phosphodiesterase 10A
Type:
Protein
Mol. Mass.:
88412.52
Organism:
Homo sapiens (Human)
Description:
Q9Y233
Residue:
779
  
Inhibitor
Name:
BDBM194404
Synonyms:
US9200016, 86 | US9902710, Compound 86
Type:
Small organic molecule
Emp. Form.:
C24H25N3O4S
Mol. Mass.:
451.538
SMILES:
CCc1ncc(Cc2ccc3cccc(NS(C)(=O)=O)c3n2)c2cc(OC)c(OC)cc12
: