Target
cAMP and cAMP-inhibited cGMP 3',5'-cyclic phosphodiesterase 10A
Ligand
BDBM194472
Substrate
Meas. Tech.
Homogenous Time-Resolved Fluorescence Resonance Energy Transfer (TR-FRET) Technology
IC50
95.0±n/a nM
Citation
 Leblond, BTaverne, TChauvignac, CBeausoleil, ECasagrande, ADesire, LPando, MPDonello, JEYang, R Substituted 6, 7-dialkoxy-3-isoquinoline derivatives as inhibitors of phosphodiesterase 10 (PDE 10A) US Patent  US9902710 Publication Date 2/27/2018 
Target
Name:
cAMP and cAMP-inhibited cGMP 3',5'-cyclic phosphodiesterase 10A
Synonyms:
3',5'-cyclic phosphodiesterase PDE10_HUMAN Phosphodiesterase 10A
Type:
Protein
Mol. Mass.:
88412.52
Organism:
Homo sapiens (Human)
Description:
Q9Y233
Residue:
779
  
Inhibitor
Name:
BDBM194472
Synonyms:
US9200016, 154 | US9902710, Compound 154
Type:
Small organic molecule
Emp. Form.:
C26H22N2O4
Mol. Mass.:
426.4639
SMILES:
COc1cc2cncc(Cc3ccc4oc(nc4c3)-c3ccccc3CO)c2cc1OC
: