Target
Fibroblast growth factor receptor 4
Ligand
BDBM373525
Substrate
Meas. Tech.
Enzymatic Assay
Kd
230±n/a nM
Citation
 Vermeulen, WHostyn, SACuyckens, FAJones, RMBroggini, DF Quinoxaline derivatives useful as FGFR kinase modulators US Patent  US9902714 Publication Date 2/27/2018 
Target
Name:
Fibroblast growth factor receptor 4
Synonyms:
CD_antigen: CD334 FGFR4 FGFR4 Fibroblast growth factor receptor JK2 TKF
Type:
Protein
Mol. Mass.:
87957.45
Organism:
Homo sapiens (Human)
Description:
P22455
Residue:
802
  
Inhibitor
Name:
BDBM373525
Synonyms:
US10421747, Compound 7 | US9902714, Compound 7
Type:
Small organic molecule
Emp. Form.:
C27H32N6O2
Mol. Mass.:
472.582
SMILES:
CCn1cc(cn1)-c1cnc2ccc(cc2n1)N1CCN(Cc2c(OC)cc(OC)cc12)C(C)C
: