Target
Lysine-specific histone demethylase 1A
Ligand
BDBM292071
Substrate
Meas. Tech.
In Vitro Enzyme Inhibition Assay
IC50
<100±n/a nM
Citation
 Chen, YKKanouni, TNie, ZStafford, JAVeal, JM Inhibitors of lysine specific demethylase-1 US Patent  US9902719 Publication Date 2/27/2018 
Target
Name:
Lysine-specific histone demethylase 1A
Synonyms:
AOF2 Flavin-containing amine oxidase domain-containing protein 2 KDM1A KIAA0601 Lysine-specific demethylase 1 (LSD1) Lysine-specific histone demethylase 1 (LSD1)
Type:
Enzyme
Mol. Mass.:
92901.01
Organism:
Homo sapiens (Human)
Description:
O60341
Residue:
852
  
Inhibitor
Name:
BDBM292071
Synonyms:
4-[5-(1-methyl-1H-indazol-5-yl)-2- {octahydro-1H-pyrrolo[3,2-c]pyridin-5-yl}- 1,3-thiazol-4-yl]benzonitrile US9902719, Example 6
Type:
Small organic molecule
Emp. Form.:
C25H24N6S
Mol. Mass.:
440.563
SMILES:
Cn1ncc2cc(ccc12)-c1sc(nc1-c1ccc(cc1)C#N)N1CCC2NCCC2C1
: