Target
Lysine-specific histone demethylase 1A
Ligand
BDBM292076
Substrate
Meas. Tech.
In Vitro Enzyme Inhibition Assay
IC50
<100±n/a nM
Citation
 Chen, YKKanouni, TNie, ZStafford, JAVeal, JM Inhibitors of lysine specific demethylase-1 US Patent  US9902719 Publication Date 2/27/2018 
Target
Name:
Lysine-specific histone demethylase 1A
Synonyms:
AOF2 Flavin-containing amine oxidase domain-containing protein 2 KDM1A KIAA0601 Lysine-specific demethylase 1 (LSD1) Lysine-specific histone demethylase 1 (LSD1)
Type:
Enzyme
Mol. Mass.:
92901.01
Organism:
Homo sapiens (Human)
Description:
O60341
Residue:
852
  
Inhibitor
Name:
BDBM292076
Synonyms:
US10100046, Example 11 cis-4-(2-{decahydropyrrolo[3,4-d]azepin-6- yl}-5-{1-methyl-1H-pyrazolo[3,4- b]pyridin-5-yl}-1,3-thiazol-4- yl)benzonitrile
Type:
Small organic molecule
Emp. Form.:
C25H25N7S
Mol. Mass.:
455.578
SMILES:
Cn1ncc2cc(cnc12)-c1sc(nc1-c1ccc(cc1)C#N)N1CC[C@@H]2CNC[C@@H]2CC1
: