Target
Lysine-specific histone demethylase 1A
Ligand
BDBM292088
Substrate
Meas. Tech.
In Vitro Enzyme Inhibition Assay
IC50
<100±n/a nM
Citation
 Chen, YKKanouni, TNie, ZStafford, JAVeal, JM Inhibitors of lysine specific demethylase-1 US Patent  US9902719 Publication Date 2/27/2018 
Target
Name:
Lysine-specific histone demethylase 1A
Synonyms:
AOF2 Flavin-containing amine oxidase domain-containing protein 2 KDM1A KIAA0601 Lysine-specific demethylase 1 (LSD1) Lysine-specific histone demethylase 1 (LSD1)
Type:
Enzyme
Mol. Mass.:
92901.01
Organism:
Homo sapiens (Human)
Description:
O60341
Residue:
852
  
Inhibitor
Name:
BDBM292088
Synonyms:
4-[4-(4-aminopiperidin-1-yl)-1-(4- cyclopropylphenyl)-6-oxopyrimidin-2-yl]- 2-fluorobenzonitrile US9902719, Example 26
Type:
Small organic molecule
Emp. Form.:
C25H24FN5O
Mol. Mass.:
429.4894
SMILES:
NC1CCN(CC1)c1cc(=O)n(-c2ccc(cc2)C2CC2)c(n1)-c1ccc(C#N)c(F)c1
: