Target
AP2-associated protein kinase 1
Ligand
BDBM311290
Substrate
Meas. Tech.
Kinase Assay
IC50
0.190±n/a nM
Citation
 Luo, GChen, LDzierba, CDDitta, JLMacor, JEBronson, JJ Biaryl kinase inhibitors US Patent  US9902722 Publication Date 2/27/2018 
Target
Name:
AP2-associated protein kinase 1
Synonyms:
AAK1 Adaptor-associated kinase 1 | KIAA1048
Type:
PROTEIN
Mol. Mass.:
103884.23
Organism:
Homo sapiens (Human)
Description:
ChEMBL_774569
Residue:
961
  
Inhibitor
Name:
BDBM311290
Synonyms:
(S)-methyl (5-((2-amino-2,4-dimethylpentyl)oxy)-4-(trifluoromethyl)-[2,4′-bipyridin]-2′-yl)carbamate US10351563, Example 146 US10723734, Example 146 US9902722, Example 146
Type:
Small organic molecule
Emp. Form.:
C20H25F3N4O3
Mol. Mass.:
426.4327
SMILES:
COC(=O)Nc1cc(ccn1)-c1cc(c(OC[C@@](C)(N)CC(C)C)cn1)C(F)(F)F
: