Target
High affinity nerve growth factor receptor
Ligand
BDBM267469
Substrate
Meas. Tech.
Binding Assay
IC50
55±n/a nM
Citation
 Andrews, SWCondroski, KRHaas, JJiang, YKolakowski, GRSeo, JYang, HZhao, Q Macrocyclic compounds as TRK kinase inhibitors US Patent  US9902741 Publication Date 2/27/2018 
Target
Name:
High affinity nerve growth factor receptor
Synonyms:
2.7.10.1 NTRK1 NTRK1_HUMAN Neurotrophic tyrosine kinase receptor type 1 Synonyms=MTC TRK1-transforming tyrosine kinase protein TRKA GN Tropomyosin alpha-3 chain/High affinity nerve growth factor receptor Tropomyosin-related kinase A (TrkA) Tyrosine kinase receptor (Trk) Tyrosine kinase receptor A (Trk A) Tyrosine kinase receptor A (TrkA) p140-TrkA
Type:
Mol. Mass.:
87498.18
Organism:
Homo sapiens (Human)
Description:
P04629
Residue:
796
  
Inhibitor
Name:
BDBM267469
Synonyms:
US10688100, Compound 45 US9718822, 45 Diastereomer 1 US9902741, Example 45 isomer 2
Type:
Small organic molecule
Emp. Form.:
C20H18F3N5O3
Mol. Mass.:
433.3838
SMILES:
O[C@H]1CNC(=O)c2cnn3ccc(nc23)N2CC(F)(F)CC2c2cc(F)ccc2OC1
: