Target
Cholinesterase
Ligand
BDBM22804
Substrate
BDBM8978
Meas. Tech.
Enzyme Inhibition Assay
Ki
7400±n/a nM
Citation
 Hyatt, JLMoak, THatfield, MJTsurkan, LEdwards, CCWierdl, MDanks, MKWadkins, RMPotter, PM Selective inhibition of carboxylesterases by isatins, indole-2,3-diones. J Med Chem 50:1876-85 (2007)  
Target
Name:
Cholinesterase
Synonyms:
Acylcholine acylhydrolase Butyrylcholine esterase (BChE) Butyrylcholinesterase (BuChE) CHLE_HUMAN Cholinesterases Pseudocholinesterase
Type:
Homotetramer
Mol. Mass.:
68422.27
Organism:
Homo sapiens (Human)
Description:
P06276
Residue:
602
  
Inhibitor
Name:
BDBM22804
Synonyms:
1-{[(2-bromophenyl)amino]methyl}-2,3-dihydro-1H-indole-2,3-dione | Isatin-based compound, 24
Type:
Small organic molecule
Emp. Form.:
C15H11BrN2O2
Mol. Mass.:
331.164
SMILES:
Brc1ccccc1NCN1C(=O)C(=O)c2ccccc12
:
Substrate
Name:
BDBM8978
Synonyms:
(Propylcarbonylthioethyl)trimethylammonium iodide CHEMBL148530 butyrylthiocholine | butyrylthiocholine chloride
Type:
Small organic molecule
Emp. Form.:
C9H20NOS
Mol. Mass.:
190.326
SMILES:
CCCC(=O)SCC[N+](C)(C)C
: