Target
Inhibitor of nuclear factor kappa-B kinase subunit beta
Ligand
BDBM373537
Substrate
Meas. Tech.
High-Throughput Assay
IC50
>10000±n/a nM
Citation
 Cheresh, DSeguin, LAnand, SLesperance, J Assays for screening for or identifying an agent or molecule that can block or inhibit AVB3 integrin from forming a complex with KRAS US Patent  US9903855 Publication Date 2/27/2018 
Target
Name:
Inhibitor of nuclear factor kappa-B kinase subunit beta
Synonyms:
I-kappa-B Kinase 2 (IKK-beta) I-kappa-B-kinase beta IKBKB IKK-beta IKK2/IKK1 IKKB_HUMAN Inhibitor of nuclear factor kappa B kinase beta subunit Nuclear factor NF-kappa-B inhibitor kinase beta
Type:
Serine/threonine-protein kinase
Mol. Mass.:
86554.39
Organism:
Homo sapiens (Human)
Description:
GST-tagged IKK-2 was expressed in High Five cells and purified.
Residue:
756
  
Inhibitor
Name:
BDBM373537
Synonyms:
US9903855, Molecule 4
Type:
Small organic molecule
Emp. Form.:
C17H16N4O3
Mol. Mass.:
324.3339
SMILES:
Oc1nc(nc(-c2ccc3OCOc3c2)c1C#N)N1CCCCC1
: