Target
Egl nine homolog 1 [182-426]
Ligand
BDBM373562
Substrate
Meas. Tech.
PHD enzymatic assay
IC50
1259±n/a nM
Citation
 Rabinowitz, MHRosen, MDTarantino, KTVenkatesan, H 4-Aminoquinazolin compounds as prolyl hydroxylase inhibitors US Patent  US10246442 Publication Date 4/2/2019 
Target
Name:
Egl nine homolog 1 [182-426]
Synonyms:
C1orf12 EGLN1_HUMAN | HIF-1alpha-PHD2
Type:
Enzyme Catalytic Domain
Mol. Mass.:
27392.37
Organism:
Homo sapiens (Human)
Description:
Q9GZT9[182-426]
Residue:
245
  
Inhibitor
Name:
BDBM373562
Synonyms:
1-[6-Cyclohexyl-4-(2,6-dimethyl-benzylamino)-quinazolin-2-yl]-1H-pyrazole-4-carboxylic acid; US10975062, Example 23
Type:
Small organic molecule
Emp. Form.:
C27H29N5O2
Mol. Mass.:
455.5515
SMILES:
Cc1cccc(C)c1CNc1nc(nc2ccc(cc12)C1CCCCC1)-n1cc(cn1)C(O)=O
: