Target
Egl nine homolog 1 [182-426]
Ligand
BDBM373591
Substrate
Meas. Tech.
PHD enzymatic assay
IC50
63.1±n/a nM
Citation
 Rabinowitz, MHRosen, MDTarantino, KTVenkatesan, H 4-Aminoquinazolin compounds as prolyl hydroxylase inhibitors US Patent  US10246442 Publication Date 4/2/2019 
Target
Name:
Egl nine homolog 1 [182-426]
Synonyms:
C1orf12 EGLN1_HUMAN | HIF-1alpha-PHD2
Type:
Enzyme Catalytic Domain
Mol. Mass.:
27392.37
Organism:
Homo sapiens (Human)
Description:
Q9GZT9[182-426]
Residue:
245
  
Inhibitor
Name:
BDBM373591
Synonyms:
1-(4-(Azepan-1-yl)-6-phenylquinazolin-2-yl)-1H-pyrazole-4-carboxylic acid; US10975062, Example 48
Type:
Small organic molecule
Emp. Form.:
C24H23N5O2
Mol. Mass.:
413.4717
SMILES:
OC(=O)c1cnn(c1)-c1nc(N2CCCCCC2)c2cc(ccc2n1)-c1ccccc1
: