Target
Egl nine homolog 1 [182-426]
Ligand
BDBM373697
Substrate
Meas. Tech.
PHD enzymatic assay
IC50
158±n/a nM
Citation
 Rabinowitz, MHRosen, MDTarantino, KTVenkatesan, H 4-Aminoquinazolin compounds as prolyl hydroxylase inhibitors US Patent  US10246442 Publication Date 4/2/2019 
Target
Name:
Egl nine homolog 1 [182-426]
Synonyms:
C1orf12 EGLN1_HUMAN | HIF-1alpha-PHD2
Type:
Enzyme Catalytic Domain
Mol. Mass.:
27392.37
Organism:
Homo sapiens (Human)
Description:
Q9GZT9[182-426]
Residue:
245
  
Inhibitor
Name:
BDBM373697
Synonyms:
1-(6-Isopropyl-4-(ethyl(methyl)amino)quinazolin-2-yl)-1H-pyrazole-4-carboxylic acid; US10975062, Example 189
Type:
Small organic molecule
Emp. Form.:
C18H21N5O2
Mol. Mass.:
339.3916
SMILES:
CCN(C)c1nc(nc2ccc(cc12)C(C)C)-n1cc(cn1)C(O)=O
: