Target
Epidermal growth factor receptor
Ligand
BDBM373698
Substrate
Meas. Tech.
Kinase assay
Kd
50±n/a nM
Citation
 Mansour, TS 1,2-dithiolane and dithiol compounds useful in treating mutant EGFR-mediated diseases and conditions US Patent  US10246444 Publication Date 4/2/2019 
Target
Name:
Epidermal growth factor receptor
Synonyms:
EGF Receptor Substrate EGFR_HUMAN ERBB1 Epidermal Growth Factor Receptor erbB-1 Epidermal growth factor receptor (EGFR) HER1 Proto-oncogene c-ErbB-1 Tyrosine-Protein Kinase ErbB-1
Type:
Receptor Kinase Domain
Mol. Mass.:
134279.59
Organism:
Homo sapiens (Human)
Description:
P00533
Residue:
1210
  
Inhibitor
Name:
BDBM373698
Synonyms:
US10246444, Example 34
Type:
Small organic molecule
Emp. Form.:
C33H30ClFN4O5S2
Mol. Mass.:
681.197
SMILES:
CCOc1cc2ncc(C#N)c(Nc3ccc(OCc4cccc(F)c4)c(Cl)c3)c2cc1NC(=O)C(CSC(C)=O)CSC(C)=O
: