Target
Epidermal growth factor receptor [L858R]
Ligand
BDBM373713
Substrate
Meas. Tech.
Kinase assay
IC50
550±n/a nM
Citation
 Mansour, TS 1,2-dithiolane and dithiol compounds useful in treating mutant EGFR-mediated diseases and conditions US Patent  US10246444 Publication Date 4/2/2019 
Target
Name:
Epidermal growth factor receptor [L858R]
Synonyms:
EGFR EGFR_HUMAN ERBB1 Epidermal growth factor receptor (L858R) HER1
Type:
Mol. Mass.:
134323.62
Organism:
Homo sapiens (Human)
Description:
P00533[L858R]
Residue:
1210
  
Inhibitor
Name:
BDBM373713
Synonyms:
US10246444, Example 29
Type:
Small organic molecule
Emp. Form.:
C26H24ClFN4O4S2
Mol. Mass.:
575.075
SMILES:
CCOc1cc2ncc(C#N)c(Nc3ccc(F)c(Cl)c3)c2cc1NC(=O)C(CSC(C)=O)CSC(C)=O
: