Target
Sodium channel protein type 8 subunit alpha
Ligand
BDBM373837
Substrate
Meas. Tech.
Electrophysiological Assay (In Vitro Assay)
IC50
11.0±n/a nM
Citation
 Andrez, JBurford, KNChowdhury, SCohen, CJDehnhardt, CMDevita, RJEmpfield, JRFocken, TGrimwood, MEHasan, SAJohnson, Jr., JPZenova, AY Benzenesulfonamide compounds and their use as therapeutic agents US Patent  US10246453 Publication Date 4/2/2019 
Target
Name:
Sodium channel protein type 8 subunit alpha
Synonyms:
MED SCN8A_HUMAN Sodium channel protein type 8 subunit alpha Voltage-gated sodium channel subunit alpha Nav1.6 | ep nav1.6
Type:
PROTEIN
Mol. Mass.:
225271.59
Organism:
Homo sapiens (Human)
Description:
ChEMBL_1516902
Residue:
1980
  
Inhibitor
Name:
BDBM373837
Synonyms:
(S)-2,6-difluoro-3-methyl-4-(methyl(1-((6-methylpyridin-2-yl)methyl)pyrrolidin-3-yl)amino)-N-(thiazol-4-yl)benzenesulfonamide formate US10662184, Example 104 | US11299490, Example 104
Type:
Small organic molecule
Emp. Form.:
C22H25F2N5O2S2
Mol. Mass.:
493.593
SMILES:
CN(C1CCN(Cc2cccc(C)n2)C1)c1cc(F)c(c(F)c1C)S(=O)(=O)Nc1cscn1
: