Target
Interleukin-1 receptor-associated kinase 4
Ligand
BDBM374268
Substrate
Meas. Tech.
Biochemical Assay
IC50
<100.0±n/a nM
Citation
 Chan, TGuckian, KJenkins, TThomas, JVessels, JKumaravel, GMeissner, RLyssikatos, JLucas, BLeaf, IDuffield, J IRAK4 inhibiting agents US Patent  US10246456 Publication Date 4/2/2019 
Target
Name:
Interleukin-1 receptor-associated kinase 4
Synonyms:
IRAK-4 IRAK4_HUMAN Interleukin-1 receptor-associated kinase 4 (IRAK4) | Renal carcinoma antigen NY-REN-64
Type:
Protein
Mol. Mass.:
51519.08
Organism:
Homo sapiens (Human)
Description:
Q9NWZ3
Residue:
460
  
Inhibitor
Name:
BDBM374268
Synonyms:
(S)-(6-(6-(4-(1-aminobutyl)pyrimidin-2-yl)-1H-indazol-1-yl)pyridin-2-yl)methanol US10246456, Example 414
Type:
Small organic molecule
Emp. Form.:
C7H8ClN3O2
Mol. Mass.:
201.61
SMILES:
CON(C)C(=O)c1ccnc(Cl)n1
: