Target
Tyrosine-protein kinase BTK
Ligand
BDBM374616
Substrate
Meas. Tech.
100P Btk Enzyme Activity Assay
IC50
2.60±n/a nM
Citation
 Siu, TAltman, MDAndresen, BMLiu, JKozlowski, JBoga, SBYu, YAnand, RCai, JWang, DLiu, S Indazole and azaindazole Btk inhibitors US Patent  US10246457 Publication Date 4/2/2019 
Target
Name:
Tyrosine-protein kinase BTK
Synonyms:
AGMX1 Agammaglobulinaemia tyrosine kinase B cell progenitor kinase BPK BTK_HUMAN Tyrosine Kinase BTK Tyrosine-protein kinase BTK (BTK)
Type:
Enzyme
Mol. Mass.:
76289.95
Organism:
Homo sapiens (Human)
Description:
Q06187
Residue:
659
  
Inhibitor
Name:
BDBM374616
Synonyms:
US10246457, Example 25
Type:
Small organic molecule
Emp. Form.:
C34H34FN7O3
Mol. Mass.:
607.6773
SMILES:
CC(C)(C)c1cc(F)c2c(cnn(-c3cccc(c3CO)-c3cc(-c4cnn(c4)C4CCOCC4)c4[nH]nc(N)c4c3)c2=O)c1
: