Target
C-C chemokine receptor type 4
Ligand
BDBM374621
Substrate
Meas. Tech.
Ca Flux assay
IC50
300±n/a nM
Citation
 Beck, HPBiannic, BBui, MHHu, DXJackson, JJKetcham, JMPowers, JPReilly, MKRobles-Resendiz, OShunatona, HPWalker, JRWustrow, DJYounai, AZibinsky, M Chemokine receptor modulators and uses thereof US Patent  US10246462 Publication Date 4/2/2019 
Target
Name:
C-C chemokine receptor type 4
Synonyms:
C-C CKR-4 C-C chemokine receptor type 4 (CCR4) CCR-4 CCR4_HUMAN CMKBR4 | K5-5
Type:
Enzyme
Mol. Mass.:
41406.41
Organism:
Homo sapiens (Human)
Description:
P51679
Residue:
360
  
Inhibitor
Name:
BDBM374621
Synonyms:
Ethyl 1-(1-(2,4-dichlorophenyl)ethyl)-6-(3′-methyl-[1,4′-bipiperidin]-1′-yl)-1H-pyrazolo[3,4-b]pyrazine-3-carboxylate hydrochloride | US10246462, Example 2
Type:
Small organic molecule
Emp. Form.:
C27H34Cl2N6O2
Mol. Mass.:
545.504
SMILES:
CCOC(=O)c1nn(C(C)c2ccc(Cl)cc2Cl)c2nc(cnc12)N1CCC(C(C)C1)N1CCCCC1
: