Target
C-C chemokine receptor type 4
Ligand
BDBM374631
Substrate
Meas. Tech.
Ca Flux assay
IC50
<100±n/a nM
Citation
 Beck, HPBiannic, BBui, MHHu, DXJackson, JJKetcham, JMPowers, JPReilly, MKRobles-Resendiz, OShunatona, HPWalker, JRWustrow, DJYounai, AZibinsky, M Chemokine receptor modulators and uses thereof US Patent  US10246462 Publication Date 4/2/2019 
Target
Name:
C-C chemokine receptor type 4
Synonyms:
C-C CKR-4 C-C chemokine receptor type 4 (CCR4) CCR-4 CCR4_HUMAN CMKBR4 | K5-5
Type:
Enzyme
Mol. Mass.:
41406.41
Organism:
Homo sapiens (Human)
Description:
P51679
Residue:
360
  
Inhibitor
Name:
BDBM374631
Synonyms:
1-((R)-1-(2,4-Dichlorophenyl)ethyl)-3-methyl-6-((3R,4S)-3-methyl-4-(pyrrolidin-1-yl)piperidin-1-yl)-1H-pyrazolo[3,4-b]pyrazine hydrochloride | US10246462, Example 12
Type:
Small organic molecule
Emp. Form.:
C24H30Cl2N6
Mol. Mass.:
473.441
SMILES:
C[C@H](c1ccc(Cl)cc1Cl)n1nc(C)c2ncc(nc12)N1CCC([C@H](C)C1)N1CCCC1
: