Target
C-C chemokine receptor type 4
Ligand
BDBM374652
Substrate
Meas. Tech.
Ca Flux assay
IC50
<100±n/a nM
Citation
 Beck, HPBiannic, BBui, MHHu, DXJackson, JJKetcham, JMPowers, JPReilly, MKRobles-Resendiz, OShunatona, HPWalker, JRWustrow, DJYounai, AZibinsky, M Chemokine receptor modulators and uses thereof US Patent  US10246462 Publication Date 4/2/2019 
Target
Name:
C-C chemokine receptor type 4
Synonyms:
C-C CKR-4 C-C chemokine receptor type 4 (CCR4) CCR-4 CCR4_HUMAN CMKBR4 | K5-5
Type:
Enzyme
Mol. Mass.:
41406.41
Organism:
Homo sapiens (Human)
Description:
P51679
Residue:
360
  
Inhibitor
Name:
BDBM374652
Synonyms:
1-((R)-1-(2,4-Dichlorophenyl)ethyl)-6-((3R,4S)-4-((S)-2-(hydroxymethyl)pyrrolidin-1-yl)-3-methylpiperidin-1-yl)-1H-pyrazolo[3,4-b]pyrazine-3-carbonitrile hydrochloride | US10246462, Example 33
Type:
Small organic molecule
Emp. Form.:
C25H29Cl2N7O
Mol. Mass.:
514.45
SMILES:
C[C@H](c1ccc(Cl)cc1Cl)n1nc(C#N)c2ncc(nc12)N1CC[C@@H]([C@H](C)C1)N1CCC[C@H]1CO
: