Target
ALK tyrosine kinase receptor
Ligand
BDBM374713
Substrate
Meas. Tech.
Kinase Binding Assays
Kd
80.0±n/a nM
Citation
 Cui, JJLi, YRogers, EWZhai, D Diaryl macrocycles as modulators of protein kinases US Patent  US10246466 Publication Date 4/2/2019 
Target
Name:
ALK tyrosine kinase receptor
Synonyms:
ALK ALK_HUMAN CD_antigen: CD246
Type:
Protein
Mol. Mass.:
176453.10
Organism:
Homo sapiens (Human)
Description:
Q9UM73
Residue:
1620
  
Inhibitor
Name:
BDBM374713
Synonyms:
11-fluoro-14-methyl-6,7,13,14-tetrahydro- 1,15-ethenopyrazolo[4,3-f][1,4,8,10] benzodioxatriazacyclotridecin-4(5H)-one US10618912, Example 20
Type:
Small organic molecule
Emp. Form.:
C17H16FN5O2
Mol. Mass.:
341.3396
SMILES:
CN1Cc2cc(F)ccc2OCCNC(=O)c2cnn3ccc1nc23
: