Target
Cellular tumor antigen p53 [16-27]/E3 ubiquitin-protein ligase Mdm2 [23-117]
Ligand
BDBM374732
Substrate
Meas. Tech.
Mdm2-p53 Inhibition AlphaScreen
IC50
557±n/a nM
Citation
 Ramharter, JBroeker, JGille, AGollner, AHenry, MKerres, NWeinstabl, H Spiro[3H-indole-3,2′-pyrrolidin]-2(1H)-one compounds and derivatives as MDM2-p53 inhibitors US Patent  US10246467 Publication Date 4/2/2019 
Target
Name:
Cellular tumor antigen p53 [16-27]/E3 ubiquitin-protein ligase Mdm2 [23-117]
Synonyms:
MDM2/P53
Type:
Protein
Mol. Mass.:
Description:
Components:
This complex has 2 components.
Component 1
Name:
E3 ubiquitin-protein ligase Mdm2 [23-117]
Synonyms:
E3 ubiquitin-protein ligase Mdm2 (23-117) MDM2 (aa 23-117) | MDM2_HUMAN
Type:
Oncoprotein
Mol. Mass.:
11177.88
Organism:
Homo sapiens (Human)
Description:
Q00987[23-117]
Residue:
95
  
Component 2
Name:
Cellular tumor antigen p53 [16-27]
Synonyms:
P53 P53_HUMAN | TP53
Type:
fusion protein
Mol. Mass.:
1475.66
Organism:
Homo sapiens (Human)
Description:
The full-length His6-wt-p53 expressed in E. coli was used in assays.
Residue:
12
QETFSDLWKLLP
  
Inhibitor
Name:
BDBM374732
Synonyms:
US10246467, Example I-3 | US10919913, # I-3
Type:
Small organic molecule
Emp. Form.:
C30H23Cl2FN4O4
Mol. Mass.:
593.432
SMILES:
OC(=O)c1ccc2c3OC[C@@H]4[C@@H]([C@@H](c5cccc(Cl)c5F)[C@]5(N4CC4CC4)C(=O)Nc4cc(Cl)ccc54)n3nc2c1
: