Target
Liver carboxylesterase 1
Ligand
BDBM22853
Substrate
BDBM22723
Meas. Tech.
Enzyme Inhibition Assay
pH
7.4±n/a
Temperature
298.15±n/a K
Ki
31±4 nM
Citation
 Hyatt, JLWadkins, RMTsurkan, LHicks, LDHatfield, MJEdwards, CCRoss, CRCantalupo, SACrundwell, GDanks, MKGuy, RKPotter, PM Planarity and constraint of the carbonyl groups in 1,2-diones are determinants for selective inhibition of human carboxylesterase 1. J Med Chem 50:5727-34 (2007)  
Target
Name:
Liver carboxylesterase 1
Synonyms:
Acyl coenzyme A:cholesterol acyltransferase CES1 EST1_HUMAN Serine hydrolase (CES1)
Type:
Protein
Mol. Mass.:
62520.83
Organism:
Homo sapiens (Human)
Description:
Residue:
567
  
Inhibitor
Name:
BDBM22853
Synonyms:
1,2-Dione-Based Compound, 10 | 1,2-dihydroacenaphthylenedione
Type:
Small organic molecule
Emp. Form.:
C12H6O2
Mol. Mass.:
182.1748
SMILES:
O=c1c2cccc3cccc(c23)c1=O
:
Substrate
Name:
BDBM22723
Synonyms:
2-nitrophenyl acetate o-NPA | o-nitrophenyl acetate
Type:
Small organic molecule
Emp. Form.:
C8H7NO4
Mol. Mass.:
181.1455
SMILES:
CC(=O)Oc1ccccc1[N+]([O-])=O
: