Target
Cholinesterase
Ligand
BDBM22848
Substrate
BDBM8978
Meas. Tech.
Cholinesterase Inhibition Assay
Ki
>100000±n/a nM
Citation
 Hyatt, JLWadkins, RMTsurkan, LHicks, LDHatfield, MJEdwards, CCRoss, CRCantalupo, SACrundwell, GDanks, MKGuy, RKPotter, PM Planarity and constraint of the carbonyl groups in 1,2-diones are determinants for selective inhibition of human carboxylesterase 1. J Med Chem 50:5727-34 (2007)  
Target
Name:
Cholinesterase
Synonyms:
Acylcholine acylhydrolase Butyrylcholine esterase (BChE) Butyrylcholinesterase (BuChE) CHLE_HUMAN Cholinesterases Pseudocholinesterase
Type:
Homotetramer
Mol. Mass.:
68422.27
Organism:
Homo sapiens (Human)
Description:
P06276
Residue:
602
  
Inhibitor
Name:
BDBM22848
Synonyms:
1,2-Dione-Based Compound, 5 | 1,2-bis(4-nitrophenyl)ethane-1,2-dione
Type:
Small organic molecule
Emp. Form.:
C14H8N2O6
Mol. Mass.:
300.2231
SMILES:
[O-][N+](=O)c1ccc(cc1)C(=O)C(=O)c1ccc(cc1)[N+]([O-])=O
:
Substrate
Name:
BDBM8978
Synonyms:
(Propylcarbonylthioethyl)trimethylammonium iodide CHEMBL148530 butyrylthiocholine | butyrylthiocholine chloride
Type:
Small organic molecule
Emp. Form.:
C9H20NOS
Mol. Mass.:
190.326
SMILES:
CCCC(=O)SCC[N+](C)(C)C
: