Target
Fibroblast growth factor receptor 2
Ligand
BDBM261980
Substrate
Meas. Tech.
FGFR Enzymatic Assay (pre-incubated for 4 hours)
IC50
<10±n/a nM
Citation
 Sokolsky, AWu, LYao, W Bicyclic heterocycles as FGFR4 inhibitors US Patent  US10251892 Publication Date 4/9/2019 
Target
Name:
Fibroblast growth factor receptor 2
Synonyms:
BEK FGFR-2 FGFR2 Fibroblast growth factor receptor 2 (FGFR2) KGFR Keratinocyte growth factor receptor VEGF-receptor 2 and Fibroblast growth factor receptor 2
Type:
Enzyme
Mol. Mass.:
92015.45
Organism:
Homo sapiens (Human)
Description:
P21802
Residue:
821
  
Inhibitor
Name:
BDBM261980
Synonyms:
6-(3-(2,6-difluoro-3,5- dimethoxyphenyl)-7-(1,3- dimethyl-1H-pyrazol-4-yl)-2- oxo-3,4-dihydropyrido[4,3- d]pyrimidin-1(2H)- yl)nicotinonitrile US10632126, Example 79 US9708318, 79
Type:
Small organic molecule
Emp. Form.:
C26H21F2N7O3
Mol. Mass.:
517.4868
SMILES:
COc1cc(OC)c(F)c(N2Cc3cnc(cc3N(C2=O)c2ccc(cn2)C#N)-c2cn(C)nc2C)c1F
: