Target
Fibroblast growth factor receptor 3
Ligand
BDBM262012
Substrate
Meas. Tech.
FGFR Enzymatic Assay (pre-incubated for 4 hours)
IC50
<10±n/a nM
Citation
 Sokolsky, AWu, LYao, W Bicyclic heterocycles as FGFR4 inhibitors US Patent  US10251892 Publication Date 4/9/2019 
Target
Name:
Fibroblast growth factor receptor 3
Synonyms:
CD_antigen: CD333 FGFR3 Fibroblast growth factor receptor JTK4
Type:
Protein
Mol. Mass.:
87699.57
Organism:
Homo sapiens (Human)
Description:
P22607
Residue:
806
  
Inhibitor
Name:
BDBM262012
Synonyms:
3-(3-(2,6-difluoro-3,5- dimethoxyphenyl)-7-(1,3- dimethy-1H-pyrazol-4-yl)-2- oxo-3,4-dihydropyrido[4,3- d]pyrimidin-1(2H)-yl)-N- methylbenzenesulfonamide US10632126, Example 111 US9708318, 111
Type:
Small organic molecule
Emp. Form.:
C27H26F2N6O5S
Mol. Mass.:
584.594
SMILES:
CNS(=O)(=O)c1cccc(c1)N1C(=O)N(Cc2cnc(cc12)-c1cn(C)nc1C)c1c(F)c(OC)cc(OC)c1F
: