Target
Fibroblast growth factor receptor 2
Ligand
BDBM262031
Substrate
Meas. Tech.
FGFR Enzymatic Assay (pre-incubated for 4 hours)
IC50
<10±n/a nM
Citation
 Sokolsky, AWu, LYao, W Bicyclic heterocycles as FGFR4 inhibitors US Patent  US10251892 Publication Date 4/9/2019 
Target
Name:
Fibroblast growth factor receptor 2
Synonyms:
BEK FGFR-2 FGFR2 Fibroblast growth factor receptor 2 (FGFR2) KGFR Keratinocyte growth factor receptor VEGF-receptor 2 and Fibroblast growth factor receptor 2
Type:
Enzyme
Mol. Mass.:
92015.45
Organism:
Homo sapiens (Human)
Description:
P21802
Residue:
821
  
Inhibitor
Name:
BDBM262031
Synonyms:
1-(4-(2'-(2,6-difluoro-3,5- dimethoxyphenyl)-3'-oxo-2',3'- dihydro-1'H-spiro[cyclopropane- 1,4'-[2,7]naphthyridine]-6'-yl)-5- methyl-1H-pyrazol-1- yl)cyclobutanecarbonitrile US10632126, Example 149 US9708318, 149
Type:
Small organic molecule
Emp. Form.:
C27H25F2N5O3
Mol. Mass.:
505.5159
SMILES:
COc1cc(OC)c(F)c(N2Cc3cnc(cc3C3(CC3)C2=O)-c2cnn(c2C)C2(CCC2)C#N)c1F
: