Target
Fibroblast growth factor receptor 2
Ligand
BDBM262032
Substrate
Meas. Tech.
FGFR Enzymatic Assay (pre-incubated for 4 hours)
IC50
<10±n/a nM
Citation
 Sokolsky, AWu, LYao, W Bicyclic heterocycles as FGFR4 inhibitors US Patent  US10251892 Publication Date 4/9/2019 
Target
Name:
Fibroblast growth factor receptor 2
Synonyms:
BEK FGFR-2 FGFR2 Fibroblast growth factor receptor 2 (FGFR2) KGFR Keratinocyte growth factor receptor VEGF-receptor 2 and Fibroblast growth factor receptor 2
Type:
Enzyme
Mol. Mass.:
92015.45
Organism:
Homo sapiens (Human)
Description:
P21802
Residue:
821
  
Inhibitor
Name:
BDBM262032
Synonyms:
6'-(1-(1-acetylpyrrolidin-3-yl)- 1H-pyrazol-4-yl)-2'-(2,6- difluoro-3,5-dimethoxyphenyl)- 1'H-spiro[cyclopropane-1,4'- [2,7]naphthyridin]-3'(2'H)-one US10632126, Example 150 US9708318, 150
Type:
Small organic molecule
Emp. Form.:
C27H27F2N5O4
Mol. Mass.:
523.5312
SMILES:
COc1cc(OC)c(F)c(N2Cc3cnc(cc3C3(CC3)C2=O)-c2cnn(c2)C2CCN(C2)C(C)=O)c1F
: