Target
Protein Wnt-3a
Ligand
BDBM374984
Substrate
Meas. Tech.
Wnt-Luc Reporter Assay
IC50
0.100±n/a nM
Citation
 Cheng, DGao, WHan, DPan, SZhang, G N-(hetero)aryl, 2-(hetero)aryl-substituted acetamides for use as Wnt signaling modulators US Patent  US10251893 Publication Date 4/9/2019 
Target
Name:
Protein Wnt-3a
Synonyms:
WNT3A | WNT3A_HUMAN
Type:
PROTEIN
Mol. Mass.:
39379.02
Organism:
Homo sapiens (Human)
Description:
ChEMBL_1469237
Residue:
352
  
Inhibitor
Name:
BDBM374984
Synonyms:
US10251893, Cpd 180
Type:
Small organic molecule
Emp. Form.:
C24H18N6O
Mol. Mass.:
406.4393
SMILES:
Cc1cc(ccn1)-c1ccc(CC(=O)Nc2ccc(nc2)-c2cnccn2)cc1C#N
: