Target
G protein-coupled receptor kinase 6
Ligand
BDBM375085
Substrate
Meas. Tech.
TBD
IC50
5920±n/a nM
Citation
 Stewart, AKPlekhov, AGreenhouse, R Inhibiting G protein coupled receptor 6 kinase polypeptides US Patent  US10252984 Publication Date 4/9/2019 
Target
Name:
G protein-coupled receptor kinase 6
Synonyms:
GPRK6 GRK6_HUMAN
Type:
PROTEIN
Mol. Mass.:
66001.83
Organism:
Homo sapiens (Human)
Description:
ChEMBL_793895
Residue:
576
  
Inhibitor
Name:
BDBM375085
Synonyms:
US10252984, Table 2.46
Type:
Small organic molecule
Emp. Form.:
C11H8F3N3O3S
Mol. Mass.:
319.26
SMILES:
OC(=O)CSc1nnc([nH]1)-c1ccc(OC(F)(F)F)cc1
: