Target
G protein-coupled receptor kinase 6
Ligand
BDBM375086
Substrate
Meas. Tech.
TBD
IC50
4600±n/a nM
Citation
 Stewart, AKPlekhov, AGreenhouse, R Inhibiting G protein coupled receptor 6 kinase polypeptides US Patent  US10252984 Publication Date 4/9/2019 
Target
Name:
G protein-coupled receptor kinase 6
Synonyms:
GPRK6 GRK6_HUMAN
Type:
PROTEIN
Mol. Mass.:
66001.83
Organism:
Homo sapiens (Human)
Description:
ChEMBL_793895
Residue:
576
  
Inhibitor
Name:
BDBM375086
Synonyms:
US10252984, Table 2.47
Type:
Small organic molecule
Emp. Form.:
C8H7N3O2S2
Mol. Mass.:
241.29
SMILES:
OC(=O)CSc1nnc([nH]1)-c1cccs1
: