Target
Free fatty acid receptor 1
Ligand
BDBM375091
Substrate
Meas. Tech.
IPOne assay
EC50
519±n/a nM
Citation
 Eckhardt, MWagner, HPeters, S Indanylaminopyrazinylcyclopropanecarboxylic acids, pharmaceutical compositions and uses thereof US Patent  US10253004 Publication Date 4/9/2019 
Target
Name:
Free fatty acid receptor 1
Synonyms:
FFAR1 G-protein Coupled Receptor 40 | GPR40
Type:
G Protein-Coupled Receptor (GPCR)
Mol. Mass.:
31473.32
Organism:
Homo sapiens (Human)
Description:
O14842
Residue:
300
  
Inhibitor
Name:
BDBM375091
Synonyms:
(1R,2R)-2-(5-{(R)-7-Fluoro-4-[4-(3-methanesulfonyl-propoxy)-2,6-dimethyl-phenyl]-indan-1-ylamino}-pyrazin-2-yl)-cyclopropanecarboxylic acid | US10253004, Example 5
Type:
Small organic molecule
Emp. Form.:
C29H32FN3O5S
Mol. Mass.:
553.645
SMILES:
Cc1cc(OCCCS(C)(=O)=O)cc(C)c1-c1ccc(F)c2[C@@H](CCc12)Nc1cnc(cn1)[C@@H]1C[C@H]1C(O)=O
: