Target
Free fatty acid receptor 1
Ligand
BDBM375106
Substrate
Meas. Tech.
IPOne assay
EC50
75.0±n/a nM
Citation
 Eckhardt, MWagner, HPeters, S Indanylaminopyrazinylcyclopropanecarboxylic acids, pharmaceutical compositions and uses thereof US Patent  US10253004 Publication Date 4/9/2019 
Target
Name:
Free fatty acid receptor 1
Synonyms:
FFAR1 G-protein Coupled Receptor 40 | GPR40
Type:
G Protein-Coupled Receptor (GPCR)
Mol. Mass.:
31473.32
Organism:
Homo sapiens (Human)
Description:
O14842
Residue:
300
  
Inhibitor
Name:
BDBM375106
Synonyms:
US10253004, Example 20
Type:
Small organic molecule
Emp. Form.:
C28H29FN4O3
Mol. Mass.:
488.5533
SMILES:
CN(C)C(=O)c1cc(C)c(c(C)c1)-c1ccc(F)c2[C@@H](CCc12)Nc1cnc(cn1)[C@H]1C[C@@H]1C(O)=O
: