Target
Prostaglandin G/H synthase 1
Ligand
BDBM22976
Substrate
BDBM22319
Meas. Tech.
Time-Dependent Inhibition Assay
pH
8±n/a
Temperature
310.15±n/a K
IC50
66000±n/a nM
Citation
 Kalgutkar, ASCrews, BCRowlinson, SWMarnett, ABKozak, KRRemmel, RPMarnett, LJ Biochemically based design of cyclooxygenase-2 (COX-2) inhibitors: facile conversion of nonsteroidal antiinflammatory drugs to potent and highly selective COX-2 inhibitors. Proc Natl Acad Sci U S A 97:925-30 (2000)  
Target
Name:
Prostaglandin G/H synthase 1
Synonyms:
COX1 Cyclooxygenase-1 (COX-1) PTGS1 | Prostaglandin G/H synthase (cyclooxygenase)
Type:
Protein
Mol. Mass.:
68868.60
Organism:
Ovis aries (Sheep)
Description:
Residue:
600
  
Inhibitor
Name:
BDBM22976
Synonyms:
CHEMBL358222 N-(benzyloxy)-2-[(2,6-dichloro-3-methylphenyl)amino]benzamide
Type:
Small organic molecule
Emp. Form.:
C21H18Cl2N2O2
Mol. Mass.:
401.286
SMILES:
Cc1ccc(Cl)c(Nc2ccccc2C(=O)NOCc2ccccc2)c1Cl
:
Substrate
Name:
BDBM22319
Synonyms:
(5Z,8Z,11Z,14Z)-icosa-5,8,11,14-tetraenoic acid Arachidonic acid (AA) [1-14C]Arachidonic acid
Type:
Unsaturated fatty acid
Emp. Form.:
C20H32O2
Mol. Mass.:
304.4669
SMILES:
CCCCC\C=C/C\C=C/C\C=C/C\C=C/CCCC(O)=O
: