Target
Prostaglandin G/H synthase 2
Ligand
BDBM22972
Substrate
BDBM22319
Meas. Tech.
Time-Dependent Inhibition Assay
Temperature
310.15±n/a K
IC50
5500±n/a nM
Comments
extracted
Citation
 Kalgutkar, ASCrews, BCRowlinson, SWMarnett, ABKozak, KRRemmel, RPMarnett, LJ Biochemically based design of cyclooxygenase-2 (COX-2) inhibitors: facile conversion of nonsteroidal antiinflammatory drugs to potent and highly selective COX-2 inhibitors. Proc Natl Acad Sci U S A 97:925-30 (2000)  
Target
Name:
Prostaglandin G/H synthase 2
Synonyms:
COX2 Cyclooxygenase 2 (COX-2) Cyclooxygenase-2 (COX-2 AA) Cyclooxygenase-2 (COX-2) PGH2_HUMAN PHS II Prostaglandin E synthase/G/H synthase 2 Prostaglandin-endoperoxide synthase 2
Type:
Enzyme
Mol. Mass.:
69003.89
Organism:
Homo sapiens (Human)
Description:
Recombinant Cox-2 provided by Cayman (Cayman Chemical Co.,Ann Arbor, MI).
Residue:
604
  
Inhibitor
Name:
BDBM22972
Synonyms:
2-[(2,6-dichloro-3-methylphenyl)amino]-N-methylbenzamide Meclofenamic acid derivative, 24
Type:
Small organic molecule
Emp. Form.:
C15H14Cl2N2O
Mol. Mass.:
309.19
SMILES:
CNC(=O)c1ccccc1Nc1c(Cl)ccc(C)c1Cl
:
Substrate
Name:
BDBM22319
Synonyms:
(5Z,8Z,11Z,14Z)-icosa-5,8,11,14-tetraenoic acid Arachidonic acid (AA) [1-14C]Arachidonic acid
Type:
Unsaturated fatty acid
Emp. Form.:
C20H32O2
Mol. Mass.:
304.4669
SMILES:
CCCCC\C=C/C\C=C/C\C=C/C\C=C/CCCC(O)=O
: