Target
Isocitrate dehydrogenase [NADP] cytoplasmic [R132H]
Ligand
BDBM375141
Substrate
Meas. Tech.
Cellular 2-HG Assay Using HCT116 Mutant IDH1 Cells
IC50
55±n/a nM
Citation
 Lin, JEricsson, ACampbell, AGustafson, GWang, ZDiebold, RBAshwell, SLancia, Jr., DRCaravella, JALu, W Pyridinyl quinolinone derivatives as mutant-isocitrate dehydrogenase inhibitors US Patent  US10253015 Publication Date 4/9/2019 
Target
Name:
Isocitrate dehydrogenase [NADP] cytoplasmic [R132H]
Synonyms:
Cytosolic NADP-isocitrate dehydrogenase (IDH1)(R132H) IDH1 R132H IDHC_HUMAN Isocitrate dehydrogenase 1 mutant (R132H) Isocitrate dehydrogenase [NADP] cytoplasmic (IDH1)(R132H) PICD
Type:
Protein
Mol. Mass.:
46641.74
Organism:
Homo sapiens (Human)
Description:
Human IDH1 R132H (SEQ ID No. 2 in patent). First three are removed. Google patent parsed wrong.
Residue:
414
  
Inhibitor
Name:
BDBM375141
Synonyms:
6-{[(1S)-1-(6-chloro-2- | US10253015, Compound I-1
Type:
Small organic molecule
Emp. Form.:
C18H15ClN4O2
Mol. Mass.:
354.79
SMILES:
COc1cc(N[C@@H](C)c2cc3cc(Cl)ccc3[nH]c2=O)ncc1C#N
: