Target
Isocitrate dehydrogenase [NADP] cytoplasmic [R132H]
Ligand
BDBM375200
Substrate
Meas. Tech.
IDH1-R132H and IDH1-R132C Enzymatic Assay
IC50
550±n/a nM
Citation
 Lin, JEricsson, ACampbell, AGustafson, GWang, ZDiebold, RBAshwell, SLancia, Jr., DRCaravella, JALu, W Pyridinyl quinolinone derivatives as mutant-isocitrate dehydrogenase inhibitors US Patent  US10253015 Publication Date 4/9/2019 
Target
Name:
Isocitrate dehydrogenase [NADP] cytoplasmic [R132H]
Synonyms:
Cytosolic NADP-isocitrate dehydrogenase (IDH1)(R132H) IDH1 R132H IDHC_HUMAN Isocitrate dehydrogenase 1 mutant (R132H) Isocitrate dehydrogenase [NADP] cytoplasmic (IDH1)(R132H) PICD
Type:
Protein
Mol. Mass.:
46641.74
Organism:
Homo sapiens (Human)
Description:
Human IDH1 R132H (SEQ ID No. 2 in patent). First three are removed. Google patent parsed wrong.
Residue:
414
  
Inhibitor
Name:
BDBM375200
Synonyms:
6-{[(6-chloro-2-oxo-1,2- | US10253015, Compound I-60
Type:
Small organic molecule
Emp. Form.:
C17H10ClF3N4O
Mol. Mass.:
378.736
SMILES:
FC(F)(F)c1nc(NCc2cc3cc(Cl)ccc3[nH]c2=O)ccc1C#N
: