Target
Adenosine receptor A2a
Ligand
BDBM375227
Substrate
Meas. Tech.
Adenosine A2B Receptor Subtype Competition Radioligand Binding Assay
Ki
500±n/a nM
Citation
 Castro-Palomino Laria, JCCamacho Gómez, JAMendoza Lizaldez, A Derivatives of 2-aminopyridine as adenosine A2B receptor antagonists and ligands of the melatonin MT3 receptors US Patent  US10253017 Publication Date 4/9/2019 
Target
Name:
Adenosine receptor A2a
Synonyms:
A2A adenosine receptor (hA2A) ADENOSINE A2 ADORA2 Adenosine A2A receptor (A2AAR)
Type:
G Protein-Coupled Receptor (GPCR)
Mol. Mass.:
44716.46
Organism:
Homo sapiens (Human)
Description:
P29274
Residue:
412
  
Inhibitor
Name:
BDBM375227
Synonyms:
3-chloro-6-(pyridin-3-yl)-5-(pyridin-4-yl)pyridin-2-amine | US10253017, Example 21
Type:
Small organic molecule
Emp. Form.:
C15H11ClN4
Mol. Mass.:
282.728
SMILES:
Nc1cc(Cl)c(-c2ccncc2)c(n1)-c1cccnc1
: