Target
Adenosine receptor A2b
Ligand
BDBM375231
Substrate
Meas. Tech.
Adenosine A2B Receptor Subtype Competition Radioligand Binding Assay
Ki
150±n/a nM
Citation
 Castro-Palomino Laria, JCCamacho Gómez, JAMendoza Lizaldez, A Derivatives of 2-aminopyridine as adenosine A2B receptor antagonists and ligands of the melatonin MT3 receptors US Patent  US10253017 Publication Date 4/9/2019 
Target
Name:
Adenosine receptor A2b
Synonyms:
AA2BR_HUMAN ADORA2B Adenosine receptors A2b | Adenosine receptors; A2a & A2b
Type:
G Protein-Coupled Receptor (GPCR)
Mol. Mass.:
36341.22
Organism:
Homo sapiens (Human)
Description:
Residue:
332
  
Inhibitor
Name:
BDBM375231
Synonyms:
3-chloro-6-(5-fluoropyridin-3-yl)-5-(3-fluoropyridin-4-yl)pyridin-2-amine | US10253017, Example 27
Type:
Small organic molecule
Emp. Form.:
C15H9ClF2N4
Mol. Mass.:
318.709
SMILES:
Nc1cc(Cl)c(-c2ccnc(F)c2)c(n1)-c1cncc(F)c1
: