Target
DNA ligase 1
Ligand
BDBM22986
Substrate
32P-labeled nicked duplex DNA substrate
Meas. Tech.
In Vitro Ligase Activity Assay
pH
8±n/a
Temperature
298.15±n/a K
IC50
212000±6000 nM
Citation
 Srivastava, SKDube, DKukshal, VJha, AKHajela, KRamachandran, R NAD+-dependent DNA ligase (Rv3014c) from Mycobacterium tuberculosis: novel structure-function relationship and identification of a specific inhibitor. Proteins 69:97-111 (2007)  
Target
Name:
DNA ligase 1
Synonyms:
ATP-dependent DNA ligase DNLI1_HUMAN LIG1 | Polydeoxyribonucleotide synthase [ATP]
Type:
Enzyme
Mol. Mass.:
101721.76
Organism:
Homo sapiens (Human)
Description:
Residue:
919
  
Inhibitor
Name:
BDBM22986
Synonyms:
18-[6-(piperidin-1-yl)hexyl]-8-thia-18-azatetracyclo[9.7.0.0^{2,7}.0^{12,17}]octadeca-1(11),2(7),3,5,12(17),13,15-heptaene Tetracyclic indole derivative, 5
Type:
Small organic molecule
Emp. Form.:
C27H34N2S
Mol. Mass.:
418.637
SMILES:
C(CCCn1c-2c(CCSc3ccccc-23)c2ccccc12)CCN1CCCCC1
:
Substrate
Name:
32P-labeled nicked duplex DNA substrate
Synonyms:
Type:
Duplex DNA
Mol. Mass.:
3295.68
Organism:
Description:
Residue:
40