Target
Inhibitor of nuclear factor kappa-B kinase subunit epsilon
Ligand
BDBM278353
Substrate
Meas. Tech.
Biological Assays for TBK1 and IKKe
IC50
1.000±n/a nM
Citation
 Du, ZGuerrero, JAKaplan, JAKnox, Jr., JELo, JRMitchell, SANaduthambi, DPhillips, BWVenkataramani, CWang, PWatkins, WJZhao, Z Tank-binding kinase inhibitor compounds US Patent  US10253019 Publication Date 4/9/2019 
Target
Name:
Inhibitor of nuclear factor kappa-B kinase subunit epsilon
Synonyms:
I kappa-B kinase epsilon I-kappa-B kinase epsilon (IKK-E) IKBKE IKK-epsilon IKKE IKKI KIAA0151 | von Hippel-Lindau disease tumor suppressor/Inhibitor of nuclear factor kappa-B kinase subunit epsilon
Type:
Serine/threonine-protein kinase
Mol. Mass.:
80475.98
Organism:
Homo sapiens (Human)
Description:
Kinase inhibitory activity was determined using recombinant human IKK-epsilon expressed in baculovirus as a FLAG-tagged fusion protein.
Residue:
716
  
Inhibitor
Name:
BDBM278353
Synonyms:
2-(((3R,4S)-1-((S)-2,3-dihydroxypropanoyl)-3-fluoropiperidin-4-yl)oxy)-5-(4-((3-methyl-4-(4-(oxetan-3-yl)piperazin-1-yl)phenyl)amino)-1,3,5-triazin-2-yl)benzonitrile US10253019, Example 575
Type:
Small organic molecule
Emp. Form.:
C32H37FN8O5
Mol. Mass.:
632.6852
SMILES:
Cc1cc(Nc2ncnc(n2)-c2ccc(O[C@H]3CCN(C[C@H]3F)C(=O)[C@@H](O)CO)c(c2)C#N)ccc1N1CCN(CC1)C1COC1
: