Target
DNA ligase 1
Ligand
BDBM23054
Substrate
BDBM23028
Meas. Tech.
FAAH Inhibition Assay
pH
9±n/a
Temperature
295.15±n/a K
Ki
4±0.7 nM
IC50
9±n/a nM
Citation
 Hardouin, CKelso, MJRomero, FARayl, TJLeung, DHwang, ICravatt, BFBoger, DL Structure-activity relationships of alpha-ketooxazole inhibitors of fatty acid amide hydrolase. J Med Chem 50:3359-68 (2007)  
Target
Name:
DNA ligase 1
Synonyms:
ATP-dependent DNA ligase DNLI1_HUMAN LIG1 | Polydeoxyribonucleotide synthase [ATP]
Type:
Enzyme
Mol. Mass.:
101721.76
Organism:
Homo sapiens (Human)
Description:
Residue:
919
  
Inhibitor
Name:
BDBM23054
Synonyms:
1-[5-(pyridin-2-yl)-1,3-oxazol-2-yl]-7-[4-(trifluoromethyl)phenyl]heptan-1-one | alpha-ketooxazole, 5z
Type:
Small organic molecule
Emp. Form.:
C22H21F3N2O2
Mol. Mass.:
402.4095
SMILES:
FC(F)(F)c1ccc(CCCCCCC(=O)c2ncc(o2)-c2ccccn2)cc1
:
Substrate
Name:
BDBM23028
Synonyms:
(9Z)-octadec-9-enamide CHEMBL15927 Oleic acid amide | Oleylamide
Type:
Emp. Form.:
C18H35NO
Mol. Mass.:
281.4766
SMILES:
CCCCCCCC\C=C/CCCCCCCC(N)=O
: