Target
Serine/threonine-protein kinase PLK4
Ligand
BDBM375326
Substrate
Meas. Tech.
Inhibition Assay
IC50
<100±n/a nM
Citation
 Sampson, PBLiu, YLi, SForrest, BTPauls, HWEdwards, LGFeher, MPatel, NKLaufer, R Kinase inhibitors and method of treating cancer US Patent  US9907800 Publication Date 3/6/2018 
Target
Name:
Serine/threonine-protein kinase PLK4
Synonyms:
PLK4 Polo-Like Kinase 4 STK18 | Serine/threonine-protein kinase PLK4
Type:
PROTEIN
Mol. Mass.:
108996.91
Organism:
Homo sapiens (Human)
Description:
ChEMBL_1474078
Residue:
970
  
Inhibitor
Name:
BDBM375326
Synonyms:
US10358436, Example A46 | US9907800, Example A46
Type:
Small organic molecule
Emp. Form.:
C26H23N3O3
Mol. Mass.:
425.4791
SMILES:
COc1ccc2NC(=O)[C@@]3(CC3c3ccc4c(n[nH]c4c3)-c3cccc(CCO)c3)c2c1
: