Target
Aurora kinase A
Ligand
BDBM375461
Substrate
Meas. Tech.
Inhibition Assay
IC50
<100±n/a nM
Citation
 Sampson, PBLiu, YLi, SForrest, BTPauls, HWEdwards, LGFeher, MPatel, NKLaufer, R Kinase inhibitors and method of treating cancer US Patent  US9907800 Publication Date 3/6/2018 
Target
Name:
Aurora kinase A
Synonyms:
AIK ARK1 AURKA AYK1 Aurora kinase A (AURA) Aurora kinase A (Aurora A) Aurora-related kinase 1 BTAK Breast-tumor-amplified kinase STK15 Serine/threonine kinase 15 Serine/threonine-protein kinase aurora A hARK1
Type:
Serine/threonine-protein kinase
Mol. Mass.:
45830.98
Organism:
Homo sapiens (Human)
Description:
O14965
Residue:
403
  
Inhibitor
Name:
BDBM375461
Synonyms:
US10358436, Example A171 | US9907800, Example A171
Type:
Small organic molecule
Emp. Form.:
C28H25ClN4O
Mol. Mass.:
468.977
SMILES:
CN(C)Cc1ccc(\C=C\c2n[nH]c3cc(ccc23)C2C[C@@]22C(=O)Nc3ccc(Cl)cc23)cc1
: