Target
Aurora kinase B
Ligand
BDBM375471
Substrate
Meas. Tech.
Inhibition Assay
IC50
<100±n/a nM
Citation
 Sampson, PBLiu, YLi, SForrest, BTPauls, HWEdwards, LGFeher, MPatel, NKLaufer, R Kinase inhibitors and method of treating cancer US Patent  US9907800 Publication Date 3/6/2018 
Target
Name:
Aurora kinase B
Synonyms:
AIK2 AIM1 ARK2 AURKB_HUMAN Aurora B-INCENP Aurora kinase B (AURKB) STK-1 STK12 Serine/threonine-protein kinase aurora B
Type:
Protein
Mol. Mass.:
39327.72
Organism:
Homo sapiens (Human)
Description:
Q96GD4
Residue:
344
  
Inhibitor
Name:
BDBM375471
Synonyms:
US9907800, Example A180
Type:
Small organic molecule
Emp. Form.:
C31H32N4O2
Mol. Mass.:
492.6114
SMILES:
COCCN1C(=O)[C@@]2(CC2c2ccc3c(\C=C\c4ccc(CN(C)C)cc4)n[nH]c3c2)c2ccccc12
: