Target
Vascular endothelial growth factor A
Ligand
BDBM372972
Substrate
Meas. Tech.
ELISA Assay
EC50
15.0±n/a nM
Citation
 Dixon, DDGrina, JJosey, JARizzi, JPSchlachter, STWallace, EMWang, BWehn, PXu, RYang, H Aryl ethers and uses thereof US Patent  US9908845 Publication Date 3/6/2018 
Target
Name:
Vascular endothelial growth factor A
Synonyms:
VEGF VEGFA VPF Vascular endothelial growth factor A (VEGF) Vascular permeability factor
Type:
Protein
Mol. Mass.:
27063.81
Organism:
Homo sapiens (Human)
Description:
P15692
Residue:
395
  
Inhibitor
Name:
BDBM372972
Synonyms:
US10597366, Compound 11 | US9896418, Compound 11
Type:
Small organic molecule
Emp. Form.:
C17H10F5NO4S
Mol. Mass.:
419.323
SMILES:
OC1c2c(CC1(F)F)c(Oc1cc(F)cc(c1)C#N)ccc2S(=O)(=O)C(F)F
: