Target
Vascular endothelial growth factor A
Ligand
BDBM372979
Substrate
Meas. Tech.
ELISA Assay
EC50
160±n/a nM
Citation
 Dixon, DDGrina, JJosey, JARizzi, JPSchlachter, STWallace, EMWang, BWehn, PXu, RYang, H Aryl ethers and uses thereof US Patent  US9908845 Publication Date 3/6/2018 
Target
Name:
Vascular endothelial growth factor A
Synonyms:
VEGF VEGFA VPF Vascular endothelial growth factor A (VEGF) Vascular permeability factor
Type:
Protein
Mol. Mass.:
27063.81
Organism:
Homo sapiens (Human)
Description:
P15692
Residue:
395
  
Inhibitor
Name:
BDBM372979
Synonyms:
US10597366, Compound 17 | US9896418, Compound 17
Type:
Small organic molecule
Emp. Form.:
C16H12ClF3O4S
Mol. Mass.:
392.777
SMILES:
OC1CCc2c1c(ccc2Oc1cc(F)cc(Cl)c1)S(=O)(=O)C(F)F
: