Target
Vascular endothelial growth factor A
Ligand
BDBM372988
Substrate
Meas. Tech.
ELISA Assay
EC50
570±n/a nM
Citation
 Dixon, DDGrina, JJosey, JARizzi, JPSchlachter, STWallace, EMWang, BWehn, PXu, RYang, H Aryl ethers and uses thereof US Patent  US9908845 Publication Date 3/6/2018 
Target
Name:
Vascular endothelial growth factor A
Synonyms:
VEGF VEGFA VPF Vascular endothelial growth factor A (VEGF) Vascular permeability factor
Type:
Protein
Mol. Mass.:
27063.81
Organism:
Homo sapiens (Human)
Description:
P15692
Residue:
232
  
Inhibitor
Name:
BDBM372988
Synonyms:
US10597366, Compound 41 | US9896418, Compound 41
Type:
Small organic molecule
Emp. Form.:
C14H9Cl2F3O4S
Mol. Mass.:
401.185
SMILES:
OCc1c(Cl)c(Oc2cc(F)cc(Cl)c2)ccc1S(=O)(=O)C(F)F
: