Target
Nuclear receptor subfamily 2 group C member 2
Ligand
BDBM375280
Substrate
Meas. Tech.
Inhibition Assay
IC50
62.2±n/a nM
Citation
 Treon, SPBuhrlage, SJGray, NSTan, LYang, G Methods to treat lymphoplasmacytic lymphoma US Patent  US9908872 Publication Date 3/6/2018 
Target
Name:
Nuclear receptor subfamily 2 group C member 2
Synonyms:
NR2C2 Nuclear receptor subfamily 2 group C member 2 TAK1 | TR4
Type:
PROTEIN
Mol. Mass.:
65411.75
Organism:
Homo sapiens (Human)
Description:
ChEMBL_1476357
Residue:
596
  
Inhibitor
Name:
BDBM375280
Synonyms:
US10597387, Compound (I-3) | US9908872, Compound (I-3)
Type:
Small organic molecule
Emp. Form.:
C29H22F3N5O2S
Mol. Mass.:
561.577
SMILES:
Cc1cn(cn1)-c1cc(NC(=O)c2ccc(C)c(NC(=O)c3cncc(c3)-c3cccs3)c2)cc(c1)C(F)(F)F
: